Target
Neuropeptide Y receptor type 1
Ligand
BDBM42479
Substrate
Meas. Tech.
Dose response counterscreen for neuropeptide Y receptor Y2 (NPY-Y2): Cell-based high throughput assay to measure NPY-Y1 antagonism
IC50
11350±n/a nM
Citation
 PubChem, PC Dose response counterscreen for neuropeptide Y receptor Y2 (NPY-Y2): Cell-based high throughput assay to measure NPY-Y1 antagonism PubChem Bioassay (2008)[AID] 
Target
Name:
Neuropeptide Y receptor type 1
Synonyms:
NPY-Y1 NPY1R NPYR neuropeptide Y receptor Y1
Type:
Enzyme Catalytic Domain
Mol. Mass.:
44399.07
Organism:
Homo sapiens (Human)
Description:
NPY-Y1 NPY1R HUMAN::P25929
Residue:
384
  
Inhibitor
Name:
BDBM42479
Synonyms:
2-(1,3-benzoxazol-2-ylsulfanyl)-1-(2,3-dihydro-1,4-benzodioxin-6-yl)ethanone MLS000049184 cid_2948077
Type:
Small organic molecule
Emp. Form.:
C17H13NO4S
Mol. Mass.:
327.354
SMILES:
O=C(CSc1nc2ccccc2o1)c1ccc2OCCOc2c1
: