Target
Neuropeptide Y receptor type 1
Ligand
BDBM42482
Substrate
Meas. Tech.
Dose response counterscreen for neuropeptide Y receptor Y2 (NPY-Y2): Cell-based high throughput assay to measure NPY-Y1 antagonism
IC50
<12000±n/a nM
Citation
 PubChem, PC Dose response counterscreen for neuropeptide Y receptor Y2 (NPY-Y2): Cell-based high throughput assay to measure NPY-Y1 antagonism PubChem Bioassay (2008)[AID] 
Target
Name:
Neuropeptide Y receptor type 1
Synonyms:
NPY-Y1 NPY1R NPYR neuropeptide Y receptor Y1
Type:
Enzyme Catalytic Domain
Mol. Mass.:
44399.07
Organism:
Homo sapiens (Human)
Description:
NPY-Y1 NPY1R HUMAN::P25929
Residue:
384
  
Inhibitor
Name:
BDBM42482
Synonyms:
(5-bromanylfuran-2-yl)-[2-[(3-methylphenyl)methylsulfanyl]-4,5-dihydroimidazol-1-yl]methanone (5-bromo-2-furyl)-[2-[(3-methylbenzyl)thio]-2-imidazolin-1-yl]methanone MLS000117091 cid_3361119
Type:
Small organic molecule
Emp. Form.:
C16H15BrN2O2S
Mol. Mass.:
379.272
SMILES:
Cc1cccc(CSC2=NCCN2C(=O)c2ccc(Br)o2)c1
: