Target
Neuropeptide Y receptor type 1
Ligand
BDBM42492
Substrate
Meas. Tech.
Dose response counterscreen for neuropeptide Y receptor Y2 (NPY-Y2): Cell-based high throughput assay to measure NPY-Y1 antagonism
IC50
8364±n/a nM
Citation
 PubChem, PC Dose response counterscreen for neuropeptide Y receptor Y2 (NPY-Y2): Cell-based high throughput assay to measure NPY-Y1 antagonism PubChem Bioassay (2008)[AID] 
Target
Name:
Neuropeptide Y receptor type 1
Synonyms:
NPY-Y1 NPY1R NPYR neuropeptide Y receptor Y1
Type:
Enzyme Catalytic Domain
Mol. Mass.:
44399.07
Organism:
Homo sapiens (Human)
Description:
NPY-Y1 NPY1R HUMAN::P25929
Residue:
384
  
Inhibitor
Name:
BDBM42492
Synonyms:
(4-bromophenyl)methyl 3-(4,5-diphenyl-1,3-oxazol-2-yl)propanoate 3-(4,5-diphenyloxazol-2-yl)propionic acid (4-bromobenzyl) ester MLS000538603 cid_2235311
Type:
Small organic molecule
Emp. Form.:
C25H20BrNO3
Mol. Mass.:
462.335
SMILES:
Brc1ccc(COC(=O)CCc2nc(c(o2)-c2ccccc2)-c2ccccc2)cc1
: