Target
Neuropeptide Y receptor type 1
Ligand
BDBM42518
Substrate
Meas. Tech.
Dose response counterscreen for neuropeptide Y receptor Y2 (NPY-Y2): Cell-based high throughput assay to measure NPY-Y1 antagonism
IC50
5266±n/a nM
Citation
 PubChem, PC Dose response counterscreen for neuropeptide Y receptor Y2 (NPY-Y2): Cell-based high throughput assay to measure NPY-Y1 antagonism PubChem Bioassay (2008)[AID] 
Target
Name:
Neuropeptide Y receptor type 1
Synonyms:
NPY-Y1 NPY1R NPYR neuropeptide Y receptor Y1
Type:
Enzyme Catalytic Domain
Mol. Mass.:
44399.07
Organism:
Homo sapiens (Human)
Description:
NPY-Y1 NPY1R HUMAN::P25929
Residue:
384
  
Inhibitor
Name:
BDBM42518
Synonyms:
3-[(3,4-dichlorobenzyl)sulfanyl]-5,6-dihydrobenzo[h]cinnoline 3-[(3,4-dichlorophenyl)methylsulfanyl]-5,6-dihydrobenzo[h]cinnoline MLS000327257 cid_6413289
Type:
Small organic molecule
Emp. Form.:
C19H14Cl2N2S
Mol. Mass.:
373.299
SMILES:
Clc1ccc(CSc2cc3CCc4ccccc4-c3nn2)cc1Cl
: