Target
Neuropeptide Y receptor type 1
Ligand
BDBM42550
Substrate
Meas. Tech.
Dose response counterscreen for neuropeptide Y receptor Y2 (NPY-Y2): Cell-based high throughput assay to measure NPY-Y1 antagonism
IC50
4576±n/a nM
Citation
 PubChem, PC Dose response counterscreen for neuropeptide Y receptor Y2 (NPY-Y2): Cell-based high throughput assay to measure NPY-Y1 antagonism PubChem Bioassay (2008)[AID] 
Target
Name:
Neuropeptide Y receptor type 1
Synonyms:
NPY-Y1 NPY1R NPYR neuropeptide Y receptor Y1
Type:
Enzyme Catalytic Domain
Mol. Mass.:
44399.07
Organism:
Homo sapiens (Human)
Description:
NPY-Y1 NPY1R HUMAN::P25929
Residue:
384
  
Inhibitor
Name:
BDBM42550
Synonyms:
MLS000590791 N-[2-(4-chlorophenyl)ethyl]-2-[3-cyano-6-(3-methoxyphenyl)pyridin-2-yl]sulfanyl-ethanamide N-[2-(4-chlorophenyl)ethyl]-2-[[3-cyano-6-(3-methoxyphenyl)-2-pyridinyl]thio]acetamide SMR000219143 | cid_1201829
Type:
Small organic molecule
Emp. Form.:
C23H20ClN3O2S
Mol. Mass.:
437.942
SMILES:
COc1cccc(c1)-c1ccc(C#N)c(SCC(=O)NCCc2ccc(Cl)cc2)n1
: