Target
Neuropeptide Y receptor type 1
Ligand
BDBM42556
Substrate
Meas. Tech.
Dose response counterscreen for neuropeptide Y receptor Y2 (NPY-Y2): Cell-based high throughput assay to measure NPY-Y1 antagonism
IC50
5100±n/a nM
Citation
 PubChem, PC Dose response counterscreen for neuropeptide Y receptor Y2 (NPY-Y2): Cell-based high throughput assay to measure NPY-Y1 antagonism PubChem Bioassay (2008)[AID] 
Target
Name:
Neuropeptide Y receptor type 1
Synonyms:
NPY-Y1 NPY1R NPYR neuropeptide Y receptor Y1
Type:
Enzyme Catalytic Domain
Mol. Mass.:
44399.07
Organism:
Homo sapiens (Human)
Description:
NPY-Y1 NPY1R HUMAN::P25929
Residue:
384
  
Inhibitor
Name:
BDBM42556
Synonyms:
3-[(2,6-dichlorophenyl)methylsulfanyl]-5-(naphthalen-1-ylmethyl)-1,2,4-triazol-4-amine 3-[[2,6-bis(chloranyl)phenyl]methylsulfanyl]-5-(naphthalen-1-ylmethyl)-1,2,4-triazol-4-amine SMR000264033 cid_2376964
Type:
Small organic molecule
Emp. Form.:
C20H16Cl2N4S
Mol. Mass.:
415.339
SMILES:
Nn1c(Cc2cccc3ccccc23)nnc1SCc1c(Cl)cccc1Cl
: