Target
Multidrug resistance-associated protein 1
Ligand
BDBM33084
Substrate
Meas. Tech.
Identification of Molecular Probes that Activate MRP-1 - Dose Response
EC50
841±n/a nM
Citation
 PubChem, PC Identification of Molecular Probes that Activate MRP-1 - Dose Response PubChem Bioassay (2007)[AID] 
Target
Name:
Multidrug resistance-associated protein 1
Synonyms:
7.6.2.2 ABCC1 ATP-binding cassette, sub-family C, member 1 isoform 1 LTC4 transporter MRP MRP1_HUMAN
Type:
Mol. Mass.:
171597.72
Organism:
Homo sapiens (Human)
Description:
P33527
Residue:
1531
  
Inhibitor
Name:
BDBM33084
Synonyms:
5-[4-(dimethylamino)phenyl]imino-1-(2-hydroxyethyl)-2,6-diketo-4-methyl-nicotinonitrile 5-[4-(dimethylamino)phenyl]imino-1-(2-hydroxyethyl)-4-methyl-2,6-dioxo-3-pyridinecarbonitrile MLS000519524 cid_672376
Type:
Small organic molecule
Emp. Form.:
C17H18N4O3
Mol. Mass.:
326.3498
SMILES:
CN(C)c1ccc(cc1)\N=C1/C(C)=C(C#N)C(=O)N(CCO)C1=O
: