Target
Coagulation factor XII
Ligand
BDBM45553
Substrate
Meas. Tech.
Factor XIIa 1536 HTS Dose Response Confirmation
IC50
532.863333±10.456684 nM
Citation
 PubChem, PC Factor XIIa 1536 HTS Dose Response Confirmation PubChem Bioassay (2008)[AID] 
Target
Name:
Coagulation factor XII
Synonyms:
Beta-factor XIIa part 1 Carboxylesterase 2 (intestine, liver) Coagulation factor XII (FXII) Coagulation factor XIIa light chain FA12_HUMAN Factor XIIa (fXIIa) Hageman factor
Type:
Enzyme
Mol. Mass.:
67810.07
Organism:
Homo sapiens (Human)
Description:
P00748
Residue:
615
  
Inhibitor
Name:
BDBM45553
Synonyms:
2,6-dimethylbenzo-1,4-quinone 4-[O-(3,4,5-trimethoxybenzoyl)oxime] 3,4,5-trimethoxybenzoic acid [(4-keto-3,5-dimethyl-cyclohexa-2,5-dien-1-ylidene)amino] ester SMR000269882 [(3,5-dimethyl-4-oxocyclohexa-2,5-dien-1-ylidene)amino] 3,4,5-trimethoxybenzoate | cid_747951
Type:
Small organic molecule
Emp. Form.:
C18H19NO6
Mol. Mass.:
345.3466
SMILES:
[#6]-[#8]-c1cc(cc(-[#8]-[#6])c1-[#8]-[#6])-[#6](=O)-[#8]\[#7]=[#6]-1/[#6]=[#6](-[#6])-[#6](=O)-[#6](-[#6])=[#6]-1
: