Target
Coagulation factor XII
Ligand
BDBM45606
Substrate
Meas. Tech.
Factor XIIa 1536 HTS Dose Response Confirmation
IC50
594.913333±25.86714 nM
Citation
 PubChem, PC Factor XIIa 1536 HTS Dose Response Confirmation PubChem Bioassay (2008)[AID] 
Target
Name:
Coagulation factor XII
Synonyms:
Beta-factor XIIa part 1 Carboxylesterase 2 (intestine, liver) Coagulation factor XII (FXII) Coagulation factor XIIa light chain FA12_HUMAN Factor XIIa (fXIIa) Hageman factor
Type:
Enzyme
Mol. Mass.:
67810.07
Organism:
Homo sapiens (Human)
Description:
P00748
Residue:
615
  
Inhibitor
Name:
BDBM45606
Synonyms:
MLS000672621 N-[(4-ethyl-5-phenacylsulfanyl-1,2,4-triazol-3-yl)methyl]-2-(4-methoxyphenyl)acetamide N-[[4-ethyl-5-(phenacylthio)-1,2,4-triazol-3-yl]methyl]-2-(4-methoxyphenyl)acetamide cid_1262768
Type:
Small organic molecule
Emp. Form.:
C22H24N4O3S
Mol. Mass.:
424.516
SMILES:
CCn1c(CNC(=O)Cc2ccc(OC)cc2)nnc1SCC(=O)c1ccccc1
: