Target
Coagulation factor XII
Ligand
BDBM33857
Substrate
Meas. Tech.
Factor XIIa 1536 HTS Dose Response Confirmation
IC50
23.623333±5.560507 nM
Citation
 PubChem, PC Factor XIIa 1536 HTS Dose Response Confirmation PubChem Bioassay (2008)[AID] 
Target
Name:
Coagulation factor XII
Synonyms:
Beta-factor XIIa part 1 Carboxylesterase 2 (intestine, liver) Coagulation factor XII (FXII) Coagulation factor XIIa light chain FA12_HUMAN Factor XIIa (fXIIa) Hageman factor
Type:
Enzyme
Mol. Mass.:
67810.07
Organism:
Homo sapiens (Human)
Description:
P00748
Residue:
615
  
Inhibitor
Name:
BDBM33857
Synonyms:
MLS000708242 [5-amino-3-(2-furanyl)-1,2,4-triazol-1-yl]-(3,4-dimethoxyphenyl)methanone [5-amino-3-(furan-2-yl)-1,2,4-triazol-1-yl]-(3,4-dimethoxyphenyl)methanone cid_969825
Type:
Small organic molecule
Emp. Form.:
C15H14N4O4
Mol. Mass.:
314.2961
SMILES:
COc1ccc(cc1OC)C(=O)n1nc(nc1N)-c1ccco1
: