Target
Coagulation factor XII
Ligand
BDBM33882
Substrate
Meas. Tech.
Factor XIIa 1536 HTS Dose Response Confirmation
IC50
327.226667±92.879161 nM
Citation
 PubChem, PC Factor XIIa 1536 HTS Dose Response Confirmation PubChem Bioassay (2008)[AID] 
Target
Name:
Coagulation factor XII
Synonyms:
Beta-factor XIIa part 1 Carboxylesterase 2 (intestine, liver) Coagulation factor XII (FXII) Coagulation factor XIIa light chain FA12_HUMAN Factor XIIa (fXIIa) Hageman factor
Type:
Enzyme
Mol. Mass.:
67810.07
Organism:
Homo sapiens (Human)
Description:
P00748
Residue:
615
  
Inhibitor
Name:
BDBM33882
Synonyms:
(5-amino-3-pyridin-3-yl-1,2,4-triazol-1-yl)-(4-chlorophenyl)methanone 1-(4-chlorobenzoyl)-3-pyridin-3-yl-1H-1,2,4-triazol-5-amine SMR000306508 [5-amino-3-(3-pyridyl)-1,2,4-triazol-1-yl]-(4-chlorophenyl)methanone | cid_5000438
Type:
Small organic molecule
Emp. Form.:
C14H10ClN5O
Mol. Mass.:
299.715
SMILES:
Nc1nc(nn1C(=O)c1ccc(Cl)cc1)-c1cccnc1
: