Target
Alkaline phosphatase, germ cell type
Ligand
BDBM41883
Substrate
Meas. Tech.
Luminescent assay for HTS discovery of chemical inhibitors of placental alkaline phosphatase confirmation
IC50
14800±n/a nM
Citation
 PubChem, PC Luminescent assay for HTS discovery of chemical inhibitors of placental alkaline phosphatase confirmation PubChem Bioassay (2009)[AID] 
Target
Name:
Alkaline phosphatase, germ cell type
Synonyms:
ALPG ALPPL2 PPBN_HUMAN | placental-like alkaline phosphatase preproprotein
Type:
PROTEIN
Mol. Mass.:
57374.31
Organism:
Homo sapiens (Human)
Description:
ChEMBL_29964
Residue:
532
  
Inhibitor
Name:
BDBM41883
Synonyms:
1-(3,4-dihydroxyphenyl)-2-[[5-(2-methoxyphenyl)-1H-1,2,4-triazol-3-yl]sulfanyl]ethanone 1-[3,4-bis(oxidanyl)phenyl]-2-[[5-(2-methoxyphenyl)-1H-1,2,4-triazol-3-yl]sulfanyl]ethanone cid_1314069
Type:
Small organic molecule
Emp. Form.:
C17H15N3O4S
Mol. Mass.:
357.384
SMILES:
COc1ccccc1-c1nnc(SCC(=O)c2ccc(O)c(O)c2)[nH]1
: