Target
Mucolipin-3
Ligand
BDBM46821
Substrate
Meas. Tech.
Dose response cell-based high-throughput screening assay for agonists of the transient receptor potential channel ML3 (TRPML3)
EC50
590±n/a nM
Citation
 PubChem, PC Dose response cell-based high-throughput screening assay for agonists of the transient receptor potential channel ML3 (TRPML3) PubChem Bioassay (2009)[AID] 
Target
Name:
Mucolipin-3
Synonyms:
MCLN3_HUMAN MCOLN3 protein
Type:
Enzyme Catalytic Domain
Mol. Mass.:
64244.09
Organism:
Homo sapiens (Human)
Description:
Q8TDD5
Residue:
553
  
Inhibitor
Name:
BDBM46821
Synonyms:
MLS000070204 N-(2-keto-2-piperidino-ethyl)-N-(2-methoxyphenyl)benzenesulfonamide N-(2-methoxyphenyl)-N-(2-oxo-2-piperidin-1-ylethyl)benzenesulfonamide SMR000011142 | cid_651524
Type:
Small organic molecule
Emp. Form.:
C20H24N2O4S
Mol. Mass.:
388.481
SMILES:
COc1ccccc1N(CC(=O)N1CCCCC1)S(=O)(=O)c1ccccc1
: