Target
Mucolipin-3
Ligand
BDBM36859
Substrate
Meas. Tech.
Dose response cell-based high-throughput screening assay for agonists of the transient receptor potential channel ML3 (TRPML3)
EC50
27400±n/a nM
Citation
 PubChem, PC Dose response cell-based high-throughput screening assay for agonists of the transient receptor potential channel ML3 (TRPML3) PubChem Bioassay (2009)[AID] 
Target
Name:
Mucolipin-3
Synonyms:
MCLN3_HUMAN MCOLN3 protein
Type:
Enzyme Catalytic Domain
Mol. Mass.:
64244.09
Organism:
Homo sapiens (Human)
Description:
Q8TDD5
Residue:
553
  
Inhibitor
Name:
BDBM36859
Synonyms:
1-(2,6-Dimethyl-piperidin-1-yl)-2-{4-[4-(4-fluoro-phenyl)-thiazol-2-yl]-piperazin-1-yl}-ethanone 1-(2,6-dimethylpiperidin-1-yl)-2-[4-[4-(4-fluorophenyl)-1,3-thiazol-2-yl]piperazin-1-yl]ethanone MLS000075090 cid_651609
Type:
Small organic molecule
Emp. Form.:
C22H29FN4OS
Mol. Mass.:
416.555
SMILES:
CC1CCCC(C)N1C(=O)CN1CCN(CC1)c1nc(cs1)-c1ccc(F)cc1
: