Target
Mucolipin-3
Ligand
BDBM46830
Substrate
Meas. Tech.
Dose response cell-based high-throughput screening assay for agonists of the transient receptor potential channel ML3 (TRPML3)
EC50
3500±n/a nM
Citation
 PubChem, PC Dose response cell-based high-throughput screening assay for agonists of the transient receptor potential channel ML3 (TRPML3) PubChem Bioassay (2009)[AID] 
Target
Name:
Mucolipin-3
Synonyms:
MCLN3_HUMAN MCOLN3 protein
Type:
Enzyme Catalytic Domain
Mol. Mass.:
64244.09
Organism:
Homo sapiens (Human)
Description:
Q8TDD5
Residue:
553
  
Inhibitor
Name:
BDBM46830
Synonyms:
MLS000047371 N-[4-chloro-3-(trifluoromethyl)phenyl]-2-[4-(4-fluorophenyl)sulfonyl-1-piperazinyl]acetamide N-[4-chloro-3-(trifluoromethyl)phenyl]-2-[4-(4-fluorophenyl)sulfonylpiperazino]acetamide SMR000033382 | cid_3239778
Type:
Small organic molecule
Emp. Form.:
C19H18ClF4N3O3S
Mol. Mass.:
479.876
SMILES:
Fc1ccc(cc1)S(=O)(=O)N1CCN(CC(=O)Nc2ccc(Cl)c(c2)C(F)(F)F)CC1
: