Target
Transcription factor p65
Ligand
BDBM49487
Substrate
Meas. Tech.
Name: High Throughput Screen to Identify Compounds that increase expression of NF-kB in Human Neuronal Cells - Dose Response
EC50
2414±n/a nM
Citation
 PubChem, PC Name: High Throughput Screen to Identify Compounds that increase expression of NF-kB in Human Neuronal Cells - Dose Response PubChem Bioassay (2008)[AID] 
Target
Name:
Transcription factor p65
Synonyms:
NFKB3 Nuclear factor NF-kappa-B p65 subunit TF65_HUMAN | v-rel reticuloendotheliosis viral oncogene homolog A isoform 1
Type:
Enzyme
Mol. Mass.:
60211.92
Organism:
Homo sapiens (Human)
Description:
Q04206
Residue:
551
  
Inhibitor
Name:
BDBM49487
Synonyms:
MLS000570667 N-(2,3-dihydro-1H-inden-5-yl)-2-benzofurancarboxamide SMR000150495 | cid_2441418
Type:
Small organic molecule
Emp. Form.:
C18H15NO2
Mol. Mass.:
277.3172
SMILES:
O=C(Nc1ccc2CCCc2c1)c1cc2ccccc2o1
: