Target
Glycoprotein 42
Ligand
BDBM50053
Substrate
Meas. Tech.
Dose Response Confirmation for Small Molecule Inhibitors of Epstein-Barr Virus
IC50
420±n/a nM
Citation
 PubChem, PC Dose Response Confirmation for Small Molecule Inhibitors of Epstein-Barr Virus PubChem Bioassay (2008)[AID] 
Target
Name:
Glycoprotein 42
Synonyms:
BZLF2 | GP42_EBVA8
Type:
Enzyme Catalytic Domain
Mol. Mass.:
25424.12
Organism:
Human herpesvirus 4 type 2
Description:
gi_139424501
Residue:
223
  
Inhibitor
Name:
BDBM50053
Synonyms:
(4Z)-4-(2-fluorobenzylidene)-2-(methylthio)-2-thiazolin-5-one (4Z)-4-[(2-fluorophenyl)methylidene]-2-methylsulfanyl-1,3-thiazol-5-one SMR000105994 | cid_1735105
Type:
Small organic molecule
Emp. Form.:
C11H8FNOS2
Mol. Mass.:
253.316
SMILES:
CSC1=N\C(=C/c2ccccc2F)C(=O)S1
: