Target
Glycoprotein 42
Ligand
BDBM50876
Substrate
Meas. Tech.
Dose Response Confirmation for Small Molecule Inhibitors of Epstein-Barr Virus
IC50
15390±n/a nM
Citation
 PubChem, PC Dose Response Confirmation for Small Molecule Inhibitors of Epstein-Barr Virus PubChem Bioassay (2008)[AID] 
Target
Name:
Glycoprotein 42
Synonyms:
BZLF2 | GP42_EBVA8
Type:
Enzyme Catalytic Domain
Mol. Mass.:
25424.12
Organism:
Human herpesvirus 4 type 2
Description:
gi_139424501
Residue:
223
  
Inhibitor
Name:
BDBM50876
Synonyms:
(3Z)-3-phenacylidene-1-phenyl-4H-quinoxalin-2-one MLS000533709 cid_5658596
Type:
Small organic molecule
Emp. Form.:
C22H16N2O2
Mol. Mass.:
340.3746
SMILES:
O=C(Cc1nc2ccccc2n(-c2ccccc2)c1=O)c1ccccc1
: