Target
E3 ubiquitin-protein ligase Mdm2
Ligand
BDBM43383
Substrate
Meas. Tech.
E3 Ligase_Mutant_Dose Response
EC50
1633960±n/a nM
Citation
 PubChem, PC E3 Ligase_Mutant_Dose Response PubChem Bioassay (2008)[AID] 
Target
Name:
E3 ubiquitin-protein ligase Mdm2
Synonyms:
Double minute 2 protein E3 ubiquitin-protein ligase Mdm2 (p53-binding protein Mdm2) Human Double Minute 2 (HDM2) MDM2-MDMX p53-Binding Protein MDM2 | p53-binding protein
Type:
Oncoprotein
Mol. Mass.:
55196.54
Organism:
Homo sapiens (Human)
Description:
Q00987
Residue:
491
  
Inhibitor
Name:
BDBM43383
Synonyms:
(Z)-3-(3,4-dimethoxyphenyl)-1-(2-ethylsulfanylbenzimidazol-1-yl)prop-2-en-1-one (Z)-3-(3,4-dimethoxyphenyl)-1-[2-(ethylthio)benzimidazol-1-yl]prop-2-en-1-one MLS000544695 cid_7285210
Type:
Small organic molecule
Emp. Form.:
C20H20N2O3S
Mol. Mass.:
368.449
SMILES:
CCSc1nc2ccccc2n1C(=O)\C=C/c1ccc(OC)c(OC)c1
: