Target
Ion channel NompC
Ligand
BDBM46889
Substrate
Meas. Tech.
Fluorescence counterscreen assay for TRPML3 agonists: dose response cell-based high-throughput screening assay to identify agonists of the transient receptor potential channel N1 (TRPN1)
EC50
29900±n/a nM
Citation
 PubChem, PC Fluorescence counterscreen assay for TRPML3 agonists: dose response cell-based high-throughput screening assay to identify agonists of the transient receptor potential channel N1 (TRPN1) PubChem Bioassay (2009)[AID] 
Target
Name:
Ion channel NompC
Synonyms:
transient receptor potential cation channel, subfamily N, member 1
Type:
Enzyme Catalytic Domain
Mol. Mass.:
175824.78
Organism:
Danio rerio
Description:
Q7T1G6
Residue:
1614
  
Inhibitor
Name:
BDBM46889
Synonyms:
4-chloranyl-N-[2,6-dimethyl-3-(4-methylpiperazin-1-yl)sulfonyl-phenyl]-N-methyl-benzenesulfonamide 4-chloro-N-[2,6-dimethyl-3-(4-methylpiperazino)sulfonyl-phenyl]-N-methyl-benzenesulfonamide 4-chloro-N-{2,6-dimethyl-3-[(4-methyl-1-piperazinyl)sulfonyl]phenyl}-N-methylbenzenesulfonamide SMR000162529 | cid_4638497
Type:
Small organic molecule
Emp. Form.:
C20H26ClN3O4S2
Mol. Mass.:
472.021
SMILES:
CN(c1c(C)ccc(c1C)S(=O)(=O)N1CCN(C)CC1)S(=O)(=O)c1ccc(Cl)cc1
: