Target
Mitogen-activated protein kinase kinase kinase kinase 2
Ligand
BDBM51801
Substrate
Meas. Tech.
Dose Response Confirmation Screen via Multiplex HTS Assay for Inhibitors of MEK Kinase PB1 Domains, specifically MEK5 binding to MEK Kinase 2 Mutant
EC50
30000±n/a nM
Citation
 PubChem, PC Dose Response Confirmation Screen via Multiplex HTS Assay for Inhibitors of MEK Kinase PB1 Domains, specifically MEK5 binding to MEK Kinase 2 Mutant PubChem Bioassay (2009)[AID] 
Target
Name:
Mitogen-activated protein kinase kinase kinase kinase 2
Synonyms:
2.7.11.1 GC kinase Germinal center kinase MAP4K2 MEK kinase kinase 2 RAB8IP | Rab8-interacting protein
Type:
Mol. Mass.:
91551.35
Organism:
Homo sapiens (Human)
Description:
Residue:
820
  
Inhibitor
Name:
BDBM51801
Synonyms:
4-({4-[(2,4-dichlorobenzyl)oxy]benzyl}amino)-1-butanol 4-[[4-[(2,4-dichlorophenyl)methoxy]phenyl]methylamino]-1-butanol;hydrochloride MLS000545464 cid_11948850
Type:
Small organic molecule
Emp. Form.:
C18H21Cl2NO2
Mol. Mass.:
354.271
SMILES:
OCCCCNCc1ccc(OCc2ccc(Cl)cc2Cl)cc1
: