Target
Mitogen-activated protein kinase kinase kinase kinase 2
Ligand
BDBM51807
Substrate
Meas. Tech.
Dose Response Confirmation Screen via Multiplex HTS Assay for Inhibitors of MEK Kinase PB1 Domains, specifically MEK5 binding to MEK Kinase 2 Mutant
EC50
30000±n/a nM
Citation
 PubChem, PC Dose Response Confirmation Screen via Multiplex HTS Assay for Inhibitors of MEK Kinase PB1 Domains, specifically MEK5 binding to MEK Kinase 2 Mutant PubChem Bioassay (2009)[AID] 
Target
Name:
Mitogen-activated protein kinase kinase kinase kinase 2
Synonyms:
2.7.11.1 GC kinase Germinal center kinase MAP4K2 MEK kinase kinase 2 RAB8IP | Rab8-interacting protein
Type:
Mol. Mass.:
91551.35
Organism:
Homo sapiens (Human)
Description:
Residue:
820
  
Inhibitor
Name:
BDBM51807
Synonyms:
MLS000582864 N-[[4-[(2-fluorophenyl)methoxy]-3-methoxyphenyl]methyl]-2-(1H-indol-3-yl)ethanamine;hydrochloride SMR000201569 cid_2982322
Type:
Small organic molecule
Emp. Form.:
C25H25FN2O2
Mol. Mass.:
404.4766
SMILES:
COc1cc(CNCCc2c[nH]c3ccccc23)ccc1OCc1ccccc1F
: