Target
Beta-lactamase
Ligand
BDBM52040
Substrate
Meas. Tech.
FRET-based counterscreen for selective VIM-2 inhibitors: dose response biochemical high throughput screening assay to identify epi-absorbance assay artifacts.
IC50
1606±n/a nM
Citation
 PubChem, PC FRET-based counterscreen for selective VIM-2 inhibitors: dose response biochemical high throughput screening assay to identify epi-absorbance assay artifacts. PubChem Bioassay (2009)[AID] 
Target
Name:
Beta-lactamase
Synonyms:
Beta lactamase
Type:
Enzyme Catalytic Domain
Mol. Mass.:
31513.38
Organism:
Pseudomonas aeruginosa
Description:
gi_114881106
Residue:
286
  
Inhibitor
Name:
BDBM52040
Synonyms:
MLS001075359 [3-(4-chlorophenyl)-5-(2-furyl)-2-pyrazolin-1-yl]-(2-furyl)methanone [5-(4-chlorophenyl)-3-(furan-2-yl)-3,4-dihydropyrazol-2-yl]-(furan-2-yl)methanone | cid_3248551
Type:
Small organic molecule
Emp. Form.:
C18H13ClN2O3
Mol. Mass.:
340.76
SMILES:
Clc1ccc(cc1)C1=NN(C(C1)c1ccco1)C(=O)c1ccco1
: