Target
POsterior Segregation
Ligand
BDBM44521
Substrate
Meas. Tech.
Fluorescent Polarization Homogeneous Dose Response HTS to Indentify Inhibitors of POS-1 Binding to mex-3-RNA
EC50
2822±n/a nM
Citation
 PubChem, PC Fluorescent Polarization Homogeneous Dose Response HTS to Indentify Inhibitors of POS-1 Binding to mex-3-RNA PubChem Bioassay (2009)[AID] 
Target
Name:
POsterior Segregation
Synonyms:
POsterior Segregation family member (pos-1)
Type:
Enzyme Catalytic Domain
Mol. Mass.:
29838.90
Organism:
Caenorhabditis elegans
Description:
gi_17562800
Residue:
264
  
Inhibitor
Name:
BDBM44521
Synonyms:
2,3,6-triphenylimidazo[1,2-b][1,2,4]triazine SMR000184539 | cid_702952
Type:
Small organic molecule
Emp. Form.:
C23H16N4
Mol. Mass.:
348.3999
SMILES:
c1c(nc2nc(-c3ccccc3)c(nn12)-c1ccccc1)-c1ccccc1
: