Target
M1 family aminopeptidase
Ligand
BDBM54025
Substrate
Meas. Tech.
Inhibitors of Plasmodium falciparum M1- Family Alanyl Aminopeptidase (M1AAP)
IC50
7440±n/a nM
Citation
 PubChem, PC Inhibitors of Plasmodium falciparum M1- Family Alanyl Aminopeptidase (M1AAP) PubChem Bioassay (2008)[AID] 
Target
Name:
M1 family aminopeptidase
Synonyms:
AMPN_PLAF7 Zinc aminopeptidase | m1-family aminopeptidase
Type:
PROTEIN
Mol. Mass.:
126072.31
Organism:
Plasmodium falciparum (isolate FcB1 / Columbia)
Description:
ChEMBL_735637
Residue:
1085
  
Inhibitor
Name:
BDBM54025
Synonyms:
2,4-diketo-7-(3-nitrophenyl)-1H-pyrido[2,3-d]pyrimidine-5-carboxylic acid ethyl ester MLS000763602 cid_5524566 ethyl 7-(3-nitrophenyl)-2,4-dioxo-1,2,3,4-tetrahydropyrido[2,3-d]pyrimidine-5-carboxylate | ethyl 7-(3-nitrophenyl)-2,4-dioxo-1H-pyrido[2,3-d]pyrimidine-5-carboxylate
Type:
Small organic molecule
Emp. Form.:
C16H12N4O6
Mol. Mass.:
356.2897
SMILES:
CCOC(=O)c1cc(nc2[nH]c(=O)[nH]c(=O)c12)-c1cccc(c1)[N+]([O-])=O
: