Target
Ras-related protein Rab-7a
Ligand
BDBM54590
Substrate
Meas. Tech.
Pyrazoline SAR compounds tested via Multiplex dose response to identify specific small molecule inhibitors of Ras and Ras-related GTPases specifically Rab7 wildtype
Ki
10±n/a nM
Citation
 PubChem, PC Pyrazoline SAR compounds tested via Multiplex dose response to identify specific small molecule inhibitors of Ras and Ras-related GTPases specifically Rab7 wildtype PubChem Bioassay (2009)[AID] 
Target
Name:
Ras-related protein Rab-7a
Synonyms:
GTP-binding protein (rab7) RAB7A | RAB7A_CANLF
Type:
Enzyme Catalytic Domain
Mol. Mass.:
23519.50
Organism:
Canis lupus familiaris
Description:
gi_164058
Residue:
207
  
Inhibitor
Name:
BDBM54590
Synonyms:
1-(3-fluorophenyl)-3,5-bis(4-methoxyphenyl)-2-pyrazoline UNM-0000305828 | cid_2827701
Type:
Small organic molecule
Emp. Form.:
C23H21FN2O2
Mol. Mass.:
376.4234
SMILES:
COc1ccc(cc1)C1CC(=NN1c1cccc(F)c1)c1ccc(OC)cc1
: