Target
Ras-related protein Rab-2A
Ligand
BDBM54588
Substrate
Meas. Tech.
Pyrazoline SAR compounds tested via Multiplex dose response to identify specific small molecule inhibitors of Ras and Ras-related GTPases specifically Rab2 wildtype
EC50
30000±n/a nM
Comments
Extracted from aid = 2045 and tid = 2
Citation
 PubChem, PC Pyrazoline SAR compounds tested via Multiplex dose response to identify specific small molecule inhibitors of Ras and Ras-related GTPases specifically Rab2 wildtype PubChem Bioassay (2016)[AID] 
Target
Name:
Ras-related protein Rab-2A
Synonyms:
RAB2 RAB2A_CANLF | Ras-related protein Rab-2A.
Type:
Enzyme Catalytic Domain
Mol. Mass.:
23545.28
Organism:
Canis lupus familiaris
Description:
gi_46577642
Residue:
212
  
Inhibitor
Name:
BDBM54588
Synonyms:
1-(3-bromophenyl)-3-(4-fluorophenyl)-5-phenyl-2-pyrazoline UNM-0000305826 | cid_2827627
Type:
Small organic molecule
Emp. Form.:
C21H16BrFN2
Mol. Mass.:
395.268
SMILES:
Fc1ccc(cc1)C1=NN(C(C1)c1ccccc1)c1cccc(Br)c1
: