Target
GTPase KRas [1-37]
Ligand
BDBM54587
Substrate
Meas. Tech.
Pyrazoline SAR compounds tested via Multiplex dose response to identify specific small molecule inhibitors of Ras and Ras-related GTPases specifically Ras activated mutant
EC50
30000±n/a nM
Citation
 PubChem, PC Pyrazoline SAR compounds tested via Multiplex dose response to identify specific small molecule inhibitors of Ras and Ras-related GTPases specifically Ras activated mutant PubChem Bioassay (2009)[AID] 
Target
Name:
GTPase KRas [1-37]
Synonyms:
ras protein
Type:
Enzyme Catalytic Domain
Mol. Mass.:
4034.04
Organism:
Homo sapiens (Human)
Description:
gi_190938
Residue:
37
  
Inhibitor
Name:
BDBM54587
Synonyms:
1-(4-nitrophenyl)-3,5-diphenyl-2-pyrazoline UNM-0000305825 | cid_2827281
Type:
Small organic molecule
Emp. Form.:
C21H17N3O2
Mol. Mass.:
343.3786
SMILES:
[O-][N+](=O)c1ccc(cc1)[N+]1=N[C-](CC1c1ccccc1)c1ccccc1
: