Target
GTPase KRas [1-37]
Ligand
BDBM54598
Substrate
Meas. Tech.
Pyrazoline SAR compounds tested via Multiplex dose response to identify specific small molecule inhibitors of Ras and Ras-related GTPases specifically Ras activated mutant
EC50
30000±n/a nM
Citation
 PubChem, PC Pyrazoline SAR compounds tested via Multiplex dose response to identify specific small molecule inhibitors of Ras and Ras-related GTPases specifically Ras activated mutant PubChem Bioassay (2009)[AID] 
Target
Name:
GTPase KRas [1-37]
Synonyms:
ras protein
Type:
Enzyme Catalytic Domain
Mol. Mass.:
4034.04
Organism:
Homo sapiens (Human)
Description:
gi_190938
Residue:
37
  
Inhibitor
Name:
BDBM54598
Synonyms:
1-(3-chlorophenyl)-3,5-diphenyl-2-pyrazoline UNM-0000305836 | cid_2841394
Type:
Small organic molecule
Emp. Form.:
C21H17ClN2
Mol. Mass.:
332.826
SMILES:
Clc1cccc(c1)N1N=C(CC1c1ccccc1)c1ccccc1
: