Target
Tyrosine-protein phosphatase non-receptor type 7
Ligand
BDBM31735
Substrate
Meas. Tech.
MOA HePTP Fluorescent secondary assay for identification of redox-state modulating compounds
IC50
127±n/a nM
Citation
 PubChem, PC MOA HePTP Fluorescent secondary assay for identification of redox-state modulating compounds PubChem Bioassay (2009)[AID] 
Target
Name:
Tyrosine-protein phosphatase non-receptor type 7
Synonyms:
He-PTP Hematopoietic protein-tyrosine phosphatase (HEPTP) PTPN7 Tyrosine-protein phosphatase non-receptor type 7 | Tyrosine-protein phosphatase non-receptor type 7 (HEPTP)
Type:
Protein
Mol. Mass.:
40530.79
Organism:
Homo sapiens (Human)
Description:
P35236
Residue:
360
  
Inhibitor
Name:
BDBM31735
Synonyms:
(7Z)-3-bromanyl-7-(furan-2-ylmethylidene)-[1,3]thiazolo[4,5]imidazo[1,2-b]pyridin-8-one (7Z)-3-bromo-7-(2-furfurylidene)thiazolo[4,5]imidazo[1,2-b]pyridin-8-one MLS-0091940.0001 | cid_6456506
Type:
Small organic molecule
Emp. Form.:
C13H6BrN3O2S
Mol. Mass.:
348.175
SMILES:
Brc1cnc2c(c1)nc1s\c(=C/c3ccco3)c(=O)n21
: