Target
Tyrosine-protein phosphatase non-receptor type 7
Ligand
BDBM46133
Substrate
Meas. Tech.
MOA HePTP Fluorescent secondary assay for identification of redox-state modulating compounds
IC50
180±n/a nM
Citation
 PubChem, PC MOA HePTP Fluorescent secondary assay for identification of redox-state modulating compounds PubChem Bioassay (2009)[AID] 
Target
Name:
Tyrosine-protein phosphatase non-receptor type 7
Synonyms:
He-PTP Hematopoietic protein-tyrosine phosphatase (HEPTP) PTPN7 Tyrosine-protein phosphatase non-receptor type 7 | Tyrosine-protein phosphatase non-receptor type 7 (HEPTP)
Type:
Protein
Mol. Mass.:
40530.79
Organism:
Homo sapiens (Human)
Description:
P35236
Residue:
360
  
Inhibitor
Name:
BDBM46133
Synonyms:
(7Z)-3-bromanyl-7-[(2-chlorophenyl)methylidene]-[1,3]thiazolo[4,5]imidazo[1,2-b]pyridin-8-one (7Z)-3-bromo-7-[(2-chlorophenyl)methylidene]-8-thiazolo[4,5]imidazo[1,2-b]pyridinone MLS-0091944.0001 | cid_2258411
Type:
Small organic molecule
Emp. Form.:
C15H7BrClN3OS
Mol. Mass.:
392.658
SMILES:
Clc1ccccc1\C=c1/sc2nc3cc(Br)cnc3n2c1=O
: