Target
Genome polyprotein
Ligand
BDBM33067
Substrate
Meas. Tech.
Fluorescence-based biochemical high throughput dose response assay for inhibitors of the Hepatitis C Virus non-structural protein 3 helicase (NS3).
IC50
8970±n/a nM
Citation
 PubChem, PC Fluorescence-based biochemical high throughput dose response assay for inhibitors of the Hepatitis C Virus non-structural protein 3 helicase (NS3). PubChem Bioassay (2009)[AID] 
Target
Name:
Genome polyprotein
Synonyms:
NS3
Type:
Enzyme Catalytic Domain
Mol. Mass.:
67067.41
Organism:
Hepatitis C virus
Description:
gi_125541954
Residue:
631
  
Inhibitor
Name:
BDBM33067
Synonyms:
4-bromanyl-2-[(E)-3-(3-methoxyphenyl)prop-2-enoyl]-7-(methylamino)cyclohepta-2,4,6-trien-1-one 4-bromo-2-[(E)-3-(3-methoxyphenyl)acryloyl]-7-(methylamino)cyclohepta-2,4,6-trien-1-one 4-bromo-2-[3-(3-methoxyphenyl)acryloyl]-7-(methylamino)-2,4,6-cycloheptatrien-1-one SMR000115629 | cid_7314634
Type:
Small organic molecule
Emp. Form.:
C18H16BrNO3
Mol. Mass.:
374.229
SMILES:
CNc1ccc(Br)cc(C(=O)\C=C\c2cccc(OC)c2)c1=O
: