Target
Genome polyprotein
Ligand
BDBM40229
Substrate
Meas. Tech.
Fluorescence-based biochemical high throughput dose response assay for inhibitors of the Hepatitis C Virus non-structural protein 3 helicase (NS3).
IC50
8623±n/a nM
Citation
 PubChem, PC Fluorescence-based biochemical high throughput dose response assay for inhibitors of the Hepatitis C Virus non-structural protein 3 helicase (NS3). PubChem Bioassay (2009)[AID] 
Target
Name:
Genome polyprotein
Synonyms:
NS3
Type:
Enzyme Catalytic Domain
Mol. Mass.:
67067.41
Organism:
Hepatitis C virus
Description:
gi_125541954
Residue:
631
  
Inhibitor
Name:
BDBM40229
Synonyms:
2-(5,6-Di-furan-2-yl-[1,2,4]triazin-3-ylsulfanyl)-N-o-tolyl-acetamide 2-[[5,6-bis(2-furyl)-1,2,4-triazin-3-yl]thio]-N-(o-tolyl)acetamide 2-[[5,6-bis(furan-2-yl)-1,2,4-triazin-3-yl]sulfanyl]-N-(2-methylphenyl)ethanamide SMR000147843 | cid_2941133
Type:
Small organic molecule
Emp. Form.:
C20H16N4O3S
Mol. Mass.:
392.431
SMILES:
Cc1ccccc1NC(=O)CSc1nnc(-c2ccco2)c(n1)-c1ccco1
: