Target
Genome polyprotein
Ligand
BDBM55051
Substrate
Meas. Tech.
Fluorescence-based biochemical high throughput dose response assay for inhibitors of the Hepatitis C Virus non-structural protein 3 helicase (NS3).
IC50
9141±n/a nM
Citation
 PubChem, PC Fluorescence-based biochemical high throughput dose response assay for inhibitors of the Hepatitis C Virus non-structural protein 3 helicase (NS3). PubChem Bioassay (2009)[AID] 
Target
Name:
Genome polyprotein
Synonyms:
NS3
Type:
Enzyme Catalytic Domain
Mol. Mass.:
67067.41
Organism:
Hepatitis C virus
Description:
gi_125541954
Residue:
631
  
Inhibitor
Name:
BDBM55051
Synonyms:
(E)-3-(3,5-dibromo-2-hydroxy-phenyl)-1-(5-methyl-2-furyl)prop-2-en-1-one (E)-3-(3,5-dibromo-2-hydroxyphenyl)-1-(5-methylfuran-2-yl)prop-2-en-1-one MLS001163887 cid_5927548
Type:
Small organic molecule
Emp. Form.:
C14H10Br2O3
Mol. Mass.:
386.035
SMILES:
Cc1ccc(o1)C(=O)\C=C\c1cc(Br)cc(Br)c1O
: