Target
Genome polyprotein
Ligand
BDBM55061
Substrate
Meas. Tech.
Fluorescence-based biochemical high throughput dose response assay for inhibitors of the Hepatitis C Virus non-structural protein 3 helicase (NS3).
IC50
5663±n/a nM
Citation
 PubChem, PC Fluorescence-based biochemical high throughput dose response assay for inhibitors of the Hepatitis C Virus non-structural protein 3 helicase (NS3). PubChem Bioassay (2009)[AID] 
Target
Name:
Genome polyprotein
Synonyms:
NS3
Type:
Enzyme Catalytic Domain
Mol. Mass.:
67067.41
Organism:
Hepatitis C virus
Description:
gi_125541954
Residue:
631
  
Inhibitor
Name:
BDBM55061
Synonyms:
2-[2-(2,5-dimethoxyphenyl)-4-hydroxy-3-[(5-methyl-2-furanyl)-oxomethyl]-5-oxo-2H-pyrrol-1-yl]-4-methyl-5-thiazolecarboxylic acid methyl ester MLS001035375 cid_2918505 methyl 2-[2-(2,5-dimethoxyphenyl)-4-hydroxy-3-(5-methylfuran-2-carbonyl)-5-oxo-2H-pyrrol-1-yl]-4-methyl-1,3-thiazole-5-carboxylate
Type:
Small organic molecule
Emp. Form.:
C24H22N2O8S
Mol. Mass.:
498.505
SMILES:
COC(=O)c1sc(nc1C)N1C(C(C(=O)c2ccc(C)o2)C(=O)C1=O)c1cc(OC)ccc1OC
: