Target
Genome polyprotein
Ligand
BDBM55065
Substrate
Meas. Tech.
Fluorescence-based biochemical high throughput dose response assay for inhibitors of the Hepatitis C Virus non-structural protein 3 helicase (NS3).
IC50
2442±n/a nM
Citation
 PubChem, PC Fluorescence-based biochemical high throughput dose response assay for inhibitors of the Hepatitis C Virus non-structural protein 3 helicase (NS3). PubChem Bioassay (2009)[AID] 
Target
Name:
Genome polyprotein
Synonyms:
NS3
Type:
Enzyme Catalytic Domain
Mol. Mass.:
67067.41
Organism:
Hepatitis C virus
Description:
gi_125541954
Residue:
631
  
Inhibitor
Name:
BDBM55065
Synonyms:
3-(5-methylfuran-2-yl)carbonyl-1-(5-methyl-1,2-oxazol-3-yl)-4-oxidanyl-2-(4-pentoxyphenyl)-2H-pyrrol-5-one 4-hydroxy-3-[(5-methyl-2-furanyl)-oxomethyl]-1-(5-methyl-3-isoxazolyl)-2-(4-pentoxyphenyl)-2H-pyrrol-5-one MLS001141112 cid_4872167
Type:
Small organic molecule
Emp. Form.:
C25H26N2O6
Mol. Mass.:
450.4837
SMILES:
CCCCCOc1ccc(cc1)C1C(C(=O)c2ccc(C)o2)C(=O)C(=O)N1c1cc(C)on1
: