Target
Genome polyprotein
Ligand
BDBM55075
Substrate
Meas. Tech.
Fluorescence-based biochemical high throughput dose response assay for inhibitors of the Hepatitis C Virus non-structural protein 3 helicase (NS3).
IC50
1738±n/a nM
Citation
 PubChem, PC Fluorescence-based biochemical high throughput dose response assay for inhibitors of the Hepatitis C Virus non-structural protein 3 helicase (NS3). PubChem Bioassay (2009)[AID] 
Target
Name:
Genome polyprotein
Synonyms:
NS3
Type:
Enzyme Catalytic Domain
Mol. Mass.:
67067.41
Organism:
Hepatitis C virus
Description:
gi_125541954
Residue:
631
  
Inhibitor
Name:
BDBM55075
Synonyms:
3-(5-methylfuran-2-yl)carbonyl-1-(5-methyl-1,2-oxazol-3-yl)-4-oxidanyl-2-(4-phenylmethoxyphenyl)-2H-pyrrol-5-one 4-hydroxy-3-[(5-methyl-2-furanyl)-oxomethyl]-1-(5-methyl-3-isoxazolyl)-2-(4-phenylmethoxyphenyl)-2H-pyrrol-5-one MLS001147817 cid_3496625
Type:
Small organic molecule
Emp. Form.:
C27H22N2O6
Mol. Mass.:
470.4734
SMILES:
Cc1ccc(o1)C(=O)C1C(N(C(=O)C1=O)c1cc(C)on1)c1ccc(OCc2ccccc2)cc1
: