Target
Streptokinase A
Ligand
BDBM58056
Substrate
Meas. Tech.
Absorbance Microorganism-Based Dose Response HTS to Identify Inhibitors of Streptokinase Expression
EC50
46222±n/a nM
Citation
 PubChem, PC Absorbance Microorganism-Based Dose Response HTS to Identify Inhibitors of Streptokinase Expression PubChem Bioassay (2009)[AID] 
Target
Name:
Streptokinase A
Synonyms:
STRP_STRP1 streptokinase A precursor
Type:
Enzyme Catalytic Domain
Mol. Mass.:
49924.80
Organism:
Streptococcus pyogenes M1 GAS
Description:
gi_15675770
Residue:
440
  
Inhibitor
Name:
BDBM58056
Synonyms:
1-[(Z)-indeno[1,2-b]quinoxalin-11-ylideneamino]urea SMR000424780 [(Z)-indeno[1,2-b]quinoxalin-11-ylideneamino]urea | cid_6883654
Type:
Small organic molecule
Emp. Form.:
C16H11N5O
Mol. Mass.:
289.2914
SMILES:
NC(=O)N=Nc1c2ccccc2c2nc3ccccc3[nH]c12
: