Target
Streptokinase A
Ligand
BDBM53474
Substrate
Meas. Tech.
Absorbance Microorganism-Based Dose Response HTS to Identify Inhibitors of Streptokinase Expression
EC50
6350±n/a nM
Citation
 PubChem, PC Absorbance Microorganism-Based Dose Response HTS to Identify Inhibitors of Streptokinase Expression PubChem Bioassay (2009)[AID] 
Target
Name:
Streptokinase A
Synonyms:
STRP_STRP1 streptokinase A precursor
Type:
Enzyme Catalytic Domain
Mol. Mass.:
49924.80
Organism:
Streptococcus pyogenes M1 GAS
Description:
gi_15675770
Residue:
440
  
Inhibitor
Name:
BDBM53474
Synonyms:
1-butyl-2-hydroxy-4-oxo-N-(phenylmethyl)-3-quinolinecarboxamide BRD-K11460778-001-04-0 N-benzyl-1-butyl-2-hydroxy-4-oxoquinoline-3-carboxamide cid_1897110
Type:
Small organic molecule
Emp. Form.:
C21H22N2O3
Mol. Mass.:
350.411
SMILES:
CCCCn1c2ccccc2c(O)c(C(=O)NCc2ccccc2)c1=O
: