Target
Alkaline phosphatase, tissue-nonspecific isozyme
Ligand
BDBM43788
Substrate
Meas. Tech.
uHTS identification of compounds activating TNAP in the absence of phosphate acceptor performed in luminescent assay
EC50
27533±n/a nM
Citation
 PubChem, PC uHTS identification of compounds activating TNAP in the absence of phosphate acceptor performed in luminescent assay PubChem Bioassay (2009)[AID] 
Target
Name:
Alkaline phosphatase, tissue-nonspecific isozyme
Synonyms:
ALPL tissue-nonspecific alkaline phosphatase precursor
Type:
PROTEIN
Mol. Mass.:
57306.17
Organism:
Homo sapiens (Human)
Description:
ChEMBL_1448917
Residue:
524
  
Inhibitor
Name:
BDBM43788
Synonyms:
2-N'-(4-chlorophenyl)sulfonyl-1-N'-pyridin-2-ylethanedihydrazide N2'-(4-chlorophenyl)sulfonyl-N1'-(2-pyridinyl)ethanedihydrazide N2'-(4-chlorophenyl)sulfonyl-N1'-pyridin-2-yl-ethanedihydrazide | cid_1596817
Type:
Small organic molecule
Emp. Form.:
C13H12ClN5O4S
Mol. Mass.:
369.783
SMILES:
Clc1ccc(cc1)S(=O)(=O)NNC(=O)C(=O)NNc1ccccn1
: