Target
M17 leucyl aminopeptidase
Ligand
BDBM56450
Substrate
Meas. Tech.
Inhibitors of Plasmodium falciparum M17- Family Leucine Aminopeptidase (M17LAP)
IC50
7670±n/a nM
Citation
 PubChem, PC Inhibitors of Plasmodium falciparum M17- Family Leucine Aminopeptidase (M17LAP) PubChem Bioassay (2009)[AID] 
Target
Name:
M17 leucyl aminopeptidase
Synonyms:
leucine aminopeptidase
Type:
Enzyme Catalytic Domain
Mol. Mass.:
67834.32
Organism:
Plasmodium falciparum 3D7
Description:
gi_124809582
Residue:
605
  
Inhibitor
Name:
BDBM56450
Synonyms:
2-[[3-isopropoxycarbonyl-5-methyl-4-(p-tolyl)-2-thienyl]carbamoyl]-7-oxabicyclo[2.2.1]heptane-3-carboxylic acid 2-[[5-methyl-4-(4-methylphenyl)-3-propan-2-yloxycarbonylthiophen-2-yl]carbamoyl]-7-oxabicyclo[2.2.1]heptane-3-carboxylic acid 3-({[3-(isopropoxycarbonyl)-5-methyl-4-(4-methylphenyl)-2-thienyl]amino}carbonyl)-7-oxabicyclo[2.2.1]heptane-2-carboxylic acid SMR000162243 | cid_3466578
Type:
Small organic molecule
Emp. Form.:
C24H27NO6S
Mol. Mass.:
457.539
SMILES:
[H]C12CCC([H])(O1)C(C2C(O)=O)C(=O)Nc1sc(C)c(c1C(=O)OC(C)C)-c1ccc(C)cc1
: