Target
G-protein coupled receptor 55
Ligand
BDBM50459
Substrate
Meas. Tech.
Image-Based HTS for Selective Antagonists for GPR55
IC50
500±n/a nM
Citation
 PubChem, PC Image-Based HTS for Selective Antagonists for GPR55 PubChem Bioassay (2010)[AID] 
Target
Name:
G-protein coupled receptor 55
Synonyms:
G protein-coupled receptor 55 GPR55_HUMAN
Type:
PROTEIN
Mol. Mass.:
36649.72
Organism:
Homo sapiens (Human)
Description:
ChEMBL_1292265
Residue:
319
  
Inhibitor
Name:
BDBM50459
Synonyms:
MLS000862518 N-[4-[(3,4-dimethyl-1,2-oxazol-5-yl)sulfamoyl]phenyl]-6,8-dimethyl-2-pyridin-2-yl-quinoline-4-carboxamide N-[4-[(3,4-dimethyl-5-isoxazolyl)sulfamoyl]phenyl]-6,8-dimethyl-2-(2-pyridinyl)-4-quinolinecarboxamide SMR000300559 | cid_1261822
Type:
Small organic molecule
Emp. Form.:
C28H25N5O4S
Mol. Mass.:
527.594
SMILES:
Cc1noc(NS(=O)(=O)c2ccc(NC(=O)c3cc(nc4c(C)cc(C)cc34)-c3ccccn3)cc2)c1C
: