Target
Regulator of G-protein signaling 16
Ligand
BDBM32274
Substrate
Meas. Tech.
Dose response, multiplexed high-throughput screen for small molecule regulators of RGS family protein interactions, specifically RGS16-Galphao for SAR Compounds
Ki
20±n/a nM
Citation
 PubChem, PC Dose response, multiplexed high-throughput screen for small molecule regulators of RGS family protein interactions, specifically RGS16-Galphao for SAR Compounds PubChem Bioassay (2010)[AID] 
Target
Name:
Regulator of G-protein signaling 16
Synonyms:
RGS16 RGSR regulator of G-protein signalling 16
Type:
Enzyme Catalytic Domain
Mol. Mass.:
22748.87
Organism:
Homo sapiens (Human)
Description:
gi_156416009
Residue:
202
  
Inhibitor
Name:
BDBM32274
Synonyms:
2,5-bis(chloranyl)-3-(4-methylpiperazin-1-yl)-6-(2-piperidin-1-yl-1,3-thiazol-5-yl)cyclohexa-2,5-diene-1,4-dione 2,5-dichloro-3-(4-methyl-1-piperazinyl)-6-[2-(1-piperidinyl)-5-thiazolyl]cyclohexa-2,5-diene-1,4-dione 2,5-dichloro-3-(4-methylpiperazino)-6-(2-piperidinothiazol-5-yl)-p-benzoquinone SMR000115103 | cid_1002249
Type:
Small organic molecule
Emp. Form.:
C19H22Cl2N4O2S
Mol. Mass.:
441.375
SMILES:
CN1CCN(CC1)C1=C(Cl)C(=O)C(c2cnc(s2)N2CCCCC2)=C(Cl)C1=O
: