Target
Serine/threonine-protein kinase Sgk1
Ligand
BDBM50043018
Substrate
Meas. Tech.
Enzymatic Activity Assay
pH
7.4±n/a
IC50
<1.20±n/a nM
Comments
extracted
Citation
 Nazare, MHalland, NSchmidt, FKleemann, HWeiss, TSaas, JStruebing, C N-(4-(azaindazol-6-yl)-phenyl)-sulfonamides and their use as pharmaceuticals US Patent  US9718825 Publication Date 8/1/2017 
Target
Name:
Serine/threonine-protein kinase Sgk1
Synonyms:
SGK SGK1_HUMAN Serine/threonine-protein kinase Sgk1 (SGK) Serum/glucocorticoid-regulated kinase 1 (SGK1)
Type:
Other Protein Type
Mol. Mass.:
48954.40
Organism:
Homo sapiens (Human)
Description:
Recombinant human SGK-1 enzyme produced in a baculovirus system.
Residue:
431
  
Inhibitor
Name:
BDBM50043018
Synonyms:
CHEMBL3355028 | US9718825, Example 63
Type:
Small organic molecule
Emp. Form.:
C20H18Cl2N6O3S
Mol. Mass.:
493.366
SMILES:
NCCCOc1nc(nc2[nH]ncc12)-c1ccc(NS(=O)(=O)c2cc(Cl)ccc2Cl)cc1
: