Target
Serine/threonine-protein kinase Sgk1
Ligand
BDBM268828
Substrate
Meas. Tech.
Enzymatic Activity Assay
pH
7.4±n/a
IC50
0.850±n/a nM
Comments
extracted
Citation
 Nazare, MHalland, NSchmidt, FKleemann, HWeiss, TSaas, JStruebing, C N-(4-(azaindazol-6-yl)-phenyl)-sulfonamides and their use as pharmaceuticals US Patent  US9718825 Publication Date 8/1/2017 
Target
Name:
Serine/threonine-protein kinase Sgk1
Synonyms:
SGK SGK1_HUMAN Serine/threonine-protein kinase Sgk1 (SGK) Serum/glucocorticoid-regulated kinase 1 (SGK1)
Type:
Other Protein Type
Mol. Mass.:
48954.40
Organism:
Homo sapiens (Human)
Description:
Recombinant human SGK-1 enzyme produced in a baculovirus system.
Residue:
431
  
Inhibitor
Name:
BDBM268828
Synonyms:
US9718825, Example 233
Type:
Small organic molecule
Emp. Form.:
C23H23ClN6O5S
Mol. Mass.:
530.984
SMILES:
COc1ccc(Cl)c(c1)S(=O)(=O)Nc1ccc(cc1)-c1nc(OCC2(CN)COC2)c2cn[nH]c2n1
: