Target
Tumor necrosis factor
Ligand
BDBM65733
Substrate
Meas. Tech.
SAR analysis of inhibitors of TNFa specific NF-kB induction - Set 2
IC50
1320±n/a nM
Citation
 PubChem, PC SAR analysis of inhibitors of TNFa specific NF-kB induction - Set 2 PubChem Bioassay (2010)[AID] 
Target
Name:
Tumor necrosis factor
Synonyms:
Cachectin TNF-a TNFA TNFSF2 Tumor necrosis factor (TNFa) Tumor necrosis factor ligand superfamily member 2 Tumor necrosis factor, soluble form | tumor necrosis factor alpha
Type:
Enzyme
Mol. Mass.:
25645.11
Organism:
Homo sapiens (Human)
Description:
P01375
Residue:
233
  
Inhibitor
Name:
BDBM65733
Synonyms:
3-methyl-8-nitro-7-(phenylmethyl)purine-2,6-dione 7-benzyl-3-methyl-8-nitropurine-2,6-dione cid_909915
Type:
Small organic molecule
Emp. Form.:
C13H11N5O4
Mol. Mass.:
301.2575
SMILES:
Cn1c2nc(n(Cc3ccccc3)c2c(=O)[nH]c1=O)[N+]([O-])=O
: