Target
Tumor necrosis factor
Ligand
BDBM59547
Substrate
Meas. Tech.
HTS dose response assay for identification of inhibitors of TNFa-specific NF-kB induction
IC50
20000±0 nM
Citation
 PubChem, PC HTS dose response assay for identification of inhibitors of TNFa-specific NF-kB induction PubChem Bioassay (2010)[AID] 
Target
Name:
Tumor necrosis factor
Synonyms:
Cachectin TNF-a TNFA TNFSF2 Tumor necrosis factor (TNFa) Tumor necrosis factor ligand superfamily member 2 Tumor necrosis factor, soluble form | tumor necrosis factor alpha
Type:
Enzyme
Mol. Mass.:
25645.11
Organism:
Homo sapiens (Human)
Description:
P01375
Residue:
233
  
Inhibitor
Name:
BDBM59547
Synonyms:
(4Z)-4-(3-bromo-4-hydroxy-5-methoxy-benzylidene)-1-(3-chlorophenyl)pyrazolidine-3,5-quinone (4Z)-4-[(3-bromo-4-hydroxy-5-methoxyphenyl)methylidene]-1-(3-chlorophenyl)pyrazolidine-3,5-dione MLS001210835 cid_1108981
Type:
Small organic molecule
Emp. Form.:
C17H12BrClN2O4
Mol. Mass.:
423.645
SMILES:
COc1cc(\C=C2\C(=O)NN(C2=O)c2cccc(Cl)c2)cc(Br)c1O
: