Target
General amino acid permease AGP1
Ligand
BDBM43506
Substrate
Meas. Tech.
Dose Response of TOR pathway GFP-fusion proteins in Saccharomyes cerevisiae specifically AGP1 based on MLPCN hits
EC50
941±n/a nM
Citation
 PubChem, PC Dose Response of TOR pathway GFP-fusion proteins in Saccharomyes cerevisiae specifically AGP1 based on MLPCN hits PubChem Bioassay (2010)[AID] 
Target
Name:
General amino acid permease AGP1
Synonyms:
AGP1 Agp1p
Type:
Enzyme Catalytic Domain
Mol. Mass.:
69674.09
Organism:
Saccharomyces cerevisiae S288c
Description:
gi_85666113
Residue:
633
  
Inhibitor
Name:
BDBM43506
Synonyms:
3-[4-phenyl-6-(trifluoromethyl)pyrimidin-2-yl]sulfonylpropionic acid ethyl ester MLS000051020 cid_2219262 ethyl 3-{[4-phenyl-6-(trifluoromethyl)-2-pyrimidinyl]sulfonyl}propanoate
Type:
Small organic molecule
Emp. Form.:
C16H15F3N2O4S
Mol. Mass.:
388.362
SMILES:
CCOC(=O)CCS(=O)(=O)c1nc(cc(n1)C(F)(F)F)-c1ccccc1
: