Target
Bcl-2-like protein 11
Ligand
BDBM67034
Substrate
Meas. Tech.
Luminescence Cell-Based Dose Retest to Identify Inhibitors of A1 Apoptosis
EC50
>350000±n/a nM
Citation
 PubChem, PC Luminescence Cell-Based Dose Retest to Identify Inhibitors of A1 Apoptosis PubChem Bioassay (2010)[AID] 
Target
Name:
Bcl-2-like protein 11
Synonyms:
B2L11_HUMAN BCL2L11 | BIM
Type:
PROTEIN
Mol. Mass.:
22175.26
Organism:
Homo sapiens (Human)
Description:
EBI_101325
Residue:
198
  
Inhibitor
Name:
BDBM67034
Synonyms:
MLS002425406 cid_44142781
Type:
Small organic molecule
Emp. Form.:
C24H30N2O7
Mol. Mass.:
458.5042
SMILES:
[H][C@]12COc3ccc(OC)cc3[C@]1([H])N1C(=O)CN(CC3CCCO3)C(=O)[C@@]1(C)[C@H]2C(=O)OCC
: