Target
Bcl-2-like protein 11
Ligand
BDBM67067
Substrate
Meas. Tech.
Luminescence Cell-Based Dose Retest to Identify Inhibitors of A1 Apoptosis
EC50
>350000±n/a nM
Citation
 PubChem, PC Luminescence Cell-Based Dose Retest to Identify Inhibitors of A1 Apoptosis PubChem Bioassay (2010)[AID] 
Target
Name:
Bcl-2-like protein 11
Synonyms:
B2L11_HUMAN BCL2L11 | BIM
Type:
PROTEIN
Mol. Mass.:
22175.26
Organism:
Homo sapiens (Human)
Description:
EBI_101325
Residue:
198
  
Inhibitor
Name:
BDBM67067
Synonyms:
2,5-dimethyl-N-[(2R,3R)-3-methyl-2-[[methyl(phenylsulfonyl)amino]methyl]-6-oxidanylidene-5-[(2S)-1-oxidanylpropan-2-yl]-3,4-dihydro-2H-1,5-benzoxazocin-10-yl]pyrazole-3-carboxamide N-[(2R,3R)-2-[[benzenesulfonyl(methyl)amino]methyl]-5-[(2S)-1-hydroxypropan-2-yl]-3-methyl-6-oxo-3,4-dihydro-2H-1,5-benzoxazocin-10-yl]-2,5-dimethyl-3-pyrazolecarboxamide N-[(2R,3R)-2-[[besyl(methyl)amino]methyl]-5-[(1S)-2-hydroxy-1-methyl-ethyl]-6-keto-3-methyl-3,4-dihydro-2H-1,5-benzoxazocin-10-yl]-2,5-dimethyl-pyrazole-3-carboxamide cid_44202940
Type:
Small organic molecule
Emp. Form.:
C28H35N5O6S
Mol. Mass.:
569.672
SMILES:
C[C@@H](CO)N1C[C@@H](C)[C@H](CN(C)S(=O)(=O)c2ccccc2)Oc2c(NC(=O)c3cc(C)nn3C)cccc2C1=O
: